Lieutenant Kitty (lt_kitty) wrote in logjam,
Lieutenant Kitty
lt_kitty
logjam

Make problem in Logjam, SUSE 9.1

Am getting the following error when I make:

icons.c: In function `icons_rarrow_pixbuf':
icons.c:42: error: `logjam_rarrow' undeclared (first use in this function)
icons.c:42: error: (Each undeclared identifier is reported only once
icons.c:42: error: for each function it appears in.)
icons.c: In function `icons_larrow_pixbuf':
icons.c:46: error: `logjam_larrow' undeclared (first use in this function)
icons.c: In function `icons_lrarrow_pixbuf':
icons.c:50: error: `logjam_lrarrow' undeclared (first use in this function)
icons.c: In function `icons_initialize':
icons.c:77: error: `logjam_goat' undeclared (first use in this function)
icons.c:78: error: `logjam_pencil' undeclared (first use in this function)
icons.c:79: error: `logjam_ljuser' undeclared (first use in this function)
icons.c:80: error: `logjam_ljcomm' undeclared (first use in this function)
icons.c:81: error: `logjam_protected' undeclared (first use in this function)
icons.c:82: error: `logjam_private' undeclared (first use in this function)
icons.c:83: error: `logjam_blogger' undeclared (first use in this function)
make[2]: *** [icons.o] Error 1
make[2]: Leaving directory `/home/kitty/logjam-4.4.0/src'
make[1]: *** [all-recursive] Error 1
make[1]: Leaving directory `/home/kitty/logjam-4.4.0'
make: *** [all] Error 2

What is up? What components am I missing to be able to install this?
Subscribe
  • Post a new comment

    Error

    default userpic
    When you submit the form an invisible reCAPTCHA check will be performed.
    You must follow the Privacy Policy and Google Terms of use.
  • 12 comments